{"text_format":"3","workbook":"xlsx","n_sheets":10,"sheets":["¿","Consumos TIPO","Tramos AF","Grupo AF","Propiedades agua","Tramos ACS","Retorno ACS","Tablas","RESUMEN","Graficos"],"not_rendered":{"charts":1,"images":21,"macros":1,"defined_names":19,"comments":4},"read":"whole","date_system":"1900"}

{"sheet":"¿","index":0,"n_rows":12,"n_cols":12,"rows_kept":12,"merged":[[3,10,7,13],[8,10,8,13],[10,10,10,13],[11,10,11,13]]}
[]
[null,"CTE HS4 SUMINISTRO DE AGUA ",{"$nulls":3},"Calculo de redes de distribución de agua fria y caliente",{"$nulls":5},"Versión v.3.1  Diciembre 2019"]
[]
[null,"Tan solo es necesario introducir datos en las casillas en color blanco.",{"$nulls":8},"Nota: La presente aplicación se proporciona bajo una licencia Creative Commons \"tal cual\", sin garantías implícitas o explícitas. Bajo ninguna circunstancia el autor se responsabiliza de su uso. "]
[null,"El resto de celdas indican los resultados de calculo"]
[]
[]
[]
[{"$nulls":10},"Actualizaciones y otras herramientas:"]
[]
{"$rows_left_out":3}
{"sheet":"Consumos TIPO","index":1,"n_rows":48,"n_cols":27,"rows_kept":48,"merged":[[2,10,2,13],[6,1,6,2],[6,10,6,11],[6,15,6,16],[6,20,6,21],[7,1,7,2],[7,7,7,8],[8,1,8,2],[8,7,8,8],[9,1,9,2],[9,7,9,8],[10,1,10,2],[10,7,10,8],[11,1,11,2],[11,7,11,8],[12,1,12,2],[12,7,12,8],[13,1,13,2],[17,3,17,5],[17,9,17,11],[17,14,17,16],[17,19,17,21],[17,24,17,26],[18,3,18,5],[18,9,18,11],[18,14,18,16],[18,19,18,21],[18,24,18,26],[36,2,36,3],[36,8,36,9],[36,13,36,14],[36,18,36,19],[36,23,36,24],[38,2,38,3],[38,8,38,9],[38,13,38,14],[38,18,38,19],[38,23,38,24],[39,2,39,3],[39,8,39,9],[39,13,39,14],[39,18,39,19],[39,23,39,24]]}
[]
[{"$nulls":8},"Actualizaciones y otras herramientas en:"]
[null,"CTE HS4  SUMINISTRO DE AGUA",{"$nulls":7},"Autor:","Oscar Redondo Rivera  o.redondo.rivera@gmail.com"]
[]
[null,null,"1.- DATOS GENERALES",{"$nulls":4},"SUMINISTRO DE AGUA FRIA",{"$nulls":11},"SUMINISTRO ACS"]
[]
[null,"Tipo edificio",null,"Viviendas",{"$nulls":6},"Q Total AF",{"$nulls":4},"Q adicional AF",{"$nulls":4},"Q total ACS"]
[null,"Temp. AF",null,{"v":10,"d":"10 ºC"},{"$nulls":3},"Uds suministro",null,"Descripcion","Uds","Q (l/s)",null,"Uds","Otros usos","Q (l/s)","Q (l/s)","D(mm)",null,null,"Uds","Q (l/s)"]
[null,"Temp ACS",null,{"v":50,"d":"50 ºC"},null,{"$f":"IF(((19+K14)/(10*(1+K14)))<0.2,0.2,((19+K14)/(10*(1+K14))))","v":{"v":0.2,"d":"0.20"}},null,{"$f":"D18","v":"VIVIENDA TIPO A"},null,{"$f":"D19","v":"Cocina + 2 baños (ducha + bañera)"},20,{"$f":"K9*E36","v":{"v":33,"d":"33.00"}},null,1,"Basuras + Baldeo",{"v":0.2,"d":"0.20"},{"$f":"N9*P9","v":{"v":0.2,"d":"0.20"}},{"$f":"IF(X9<13.1,16,IF($C$46=\"Cobre\",INDEX(Tablas!$B$137:$B$146,MATCH(X9,Tablas!$C$137:$C$146,1)+1,1),INDEX(Tablas!$S$98:$S$111,MATCH(X9,Tablas!$R$98:$R$111,1)+1,1)))","v":16},null,{"$f":"H9","v":"VIVIENDA TIPO A"},2,{"$f":"F36*K9","v":{"v":18.2,"d":"18.20"}},null,{"$f":"(4000*P9/(3.1416*$D$11))^0.5","v":{"v":9.213166547046368,"d":"9.21"}},{"$f":"IF($C$46=\"Cobre\",VLOOKUP($R$9,Tablas!$B$137:$C$146,2,FALSE),INDEX(Tablas!$R$98:$R$111,MATCH(IF(X9<13,13,X9),Tablas!$R$98:$R$111,1)+1,1))","v":13.1},{"$f":"4000*P9/(3.1416*Y9*Y9)","v":1.483872230469337}]
[null,"Simultaneidad",null,"UNE 149.201/07",null,{"$f":"IF((L14+Q14)<20,0.682*((L14+Q14)^0.45)-0.14,1.7*((L14+Q14)^0.21)-0.7)/(L14+Q14)","v":{"v":0.06496329435222663,"d":"0.06"}},null,{"$f":"J18","v":"VIVIENDA TIPO B"},null,{"$f":"J19","v":"Duplex Cocina + 3 baños (2xducha + bañera)"},5,{"$f":"K10*K36","v":9.25},null,1,"Riego",{"v":1,"d":"1.00"},{"$f":"N10*P10","v":{"v":1,"d":"1.00"}},{"$f":"IF(X10<13.1,16,IF($C$46=\"Cobre\",INDEX(Tablas!$B$137:$B$146,MATCH(X10,Tablas!$C$137:$C$146,1)+1,1),INDEX(Tablas!$S$98:$S$111,MATCH(X10,Tablas!$R$98:$R$111,1)+1,1)))","v":32},null,{"$f":"H10","v":"VIVIENDA TIPO B"},4,{"$f":"L36*K10","v":5.05},null,{"$f":"(4000*P10/(3.1416*$D$11))^0.5","v":{"v":20.601266687222694,"d":"20.60"}},{"$f":"IF($C$46=\"Cobre\",VLOOKUP($R$9,Tablas!$B$137:$C$146,2,FALSE),INDEX(Tablas!$R$98:$R$111,MATCH(IF(X10<13,13,X10),Tablas!$R$98:$R$111,1)+1,1))","v":26.2},{"$f":"4000*P10/(3.1416*Y10*Y10)","v":1.8548402880866712}]
{"$rows_left_out":39}
{"sheet":"Tramos AF","index":2,"n_rows":17,"n_cols":84,"rows_kept":17,"merged":[[1,1,1,2],[1,5,1,7],[3,1,3,2],[4,1,4,2],[5,1,5,2],[8,1,8,2],[9,1,9,2],[11,1,11,2],[13,24,13,28],[14,24,14,28],[15,23,15,27]]}
[]
[null,"Altura max entre suminstro y consumo",null,{"v":17,"d":"17.00 m"},null,"INSTALACIÓN DE AGUA FRÍA",{"$nulls":13},"Medición  de tuberias según diámetro"]
[null,"Pres. mín. en punto suministro",null,{"v":1,"d":"1.00 bar"},{"$nulls":15},12,16,20,null,25,32,40,50,63,75,null,90,110,125,140,160]
[null,"Pres. max. en punto suministro",null,{"v":5,"d":"5.00 bar"},{"$nulls":15},{"$f":"SUM(BS:BS)","v":0},{"$f":"SUM(BT:BT)","v":0},{"$f":"SUM(BU:BU)","v":0},null,{"$f":"SUM(BV:BV)","v":0},{"$f":"SUM(BW:BW)","v":0},{"$f":"SUM(BX:BX)","v":0},{"$f":"SUM(BY:BY)","v":22},{"$f":"SUM(BZ:BZ)","v":0},{"$f":"SUM(CA:CA)","v":0},null,{"$f":"SUM(CB:CB)","v":0},{"$f":"SUM(CC:CC)","v":0},{"$f":"SUM(CD:CD)","v":0},{"$f":"SUM(CE:CE)","v":0},{"$f":"SUM(CF:CF)","v":0}]
[null,"Presión max. equipo bombeo",null,{"$f":"'Grupo AF'!D29","v":{"v":6.7235727632988755,"d":"6.72 bar"}},{"$nulls":47},"regimen"]
[null,"Perdida de carga tramo + desfavorable",null,{"$f":"SUM(BA:BA)","v":{"v":6.32251834033779,"d":"6.32 mca"}},{"$nulls":47},"turbulento"]
[{"$nulls":48},"Habitual",null,null,"agua fria"]
[1]
[null,"Tramo",null,"Consumos tipo","Unidades","Consumo","Consumo","Otros Consumos","Caudal","Uso","Qu","fila","suplemento","fila","fila ","fila ","Coef.","Coef.","Coef.","Q l/s","Q l/s","K",null,"Velocidad","Diámetro","Diámetro","Diámetro","Diámetro","Velocidad",null,"Pérdida","Pérdida","+25%","Pérdida","Pérdida",null,"ID","Presion","Presion",null,"Viscos.","Rugosidad","Número","Factor","Coef.","Coef.","Perdida","Perdida","Perdida","Flamant","Perdida","Perdida","Suma a",null,1,{"$f":"BC9+1","v":2},{"$f":"BD9+1","v":3},4,5,6,7,8,9,10,11,12,13,14,null,null,{"$f":"BC14","v":0},{"$f":"BD14","v":0},0,0,0,0,22,0,0,0,0,0,0,0]
[1,"Descripcion",null,null,"de cada","x unidad","instalado",null,"Otros",null,"mayor","tipo","fila","distinto","escuelas","busqueda","A","B","C","TOTAL","simult.","Simult.",null,"Teórica","Teórico Int","Nom. Ext.","Nom. Ext.","Nom. Int.","Real",null,"Tubería","Tubería","Accesorios","Total","TOTAL",null,"Tramo","Inicial","residual",null,"agua","Absoluta","Reynols","K/d","rugosidad","rugosidad","Carga","según","según","para ACS","según","según","tramo",null,12,16,20,25,32,40,50,63,75,90,110,125,140,160]
{"$rows_left_out":8}
{"sheet":"Grupo AF","index":3,"n_rows":43,"n_cols":15,"rows_kept":43,"merged":[[1,14,1,26],[17,7,17,8]]}
[]
[null,"GRUPO DE PRESIÓN AGUA FRÍA",null,"EQUIPOS DE CAUDAL VARIABLE",{"$nulls":8},"Grupos EBARA AP-MVP",null,"http://www.ebara.es/productos/bombas-centrifugas-verticales/mvp/"]
[{"$nulls":12},"Grupos EBARA 1 bomba"]
[null,"Número consumos tipo",{"$f":"SUM('Consumos TIPO'!K9:K13)","v":25}]
[null,"Caudal simutaneo total",{"$f":"'Consumos TIPO'!D13","v":{"v":3.137771446337956,"d":"3.14 l/s"}},{"$f":"C5*60","v":{"v":188.26628678027734,"d":"188 l/min"}},{"$f":"D5*0.06","v":{"v":11.29597720681664,"d":"11.30 m3/h"}}]
[]
[null,"Perdida de carga lineal",{"$f":"'Tramos AF'!D6","v":{"v":6.32251834033779,"d":"6.32 mca"}},null,{"$f":"C7/$C$12","v":{"v":0.16650303025212024,"d":"16.65%"}}]
[null,"Altura geométrica",{"$f":"'Tramos AF'!$D$2","v":{"v":17,"d":"17.00 m"}},null,{"$f":"C8/$C$12","v":{"v":0.44769368183988817,"d":"44.77%"}}]
[null,"Presion residual",{"v":1,"d":"1.00 bar"},{"$f":"C9*100/9.806","v":{"v":10.197838058331634,"d":"10.20 mca"}},{"$f":"D9/$C$12","v":{"v":0.2685592745377309,"d":"26.86%"}}]
[null,"Altura de aspiración",{"v":1,"d":"1.00 m"},null,{"v":0.02633492246116989,"d":"2.63%"}]
{"$rows_left_out":34}
{"sheet":"Propiedades agua","index":4,"n_rows":28,"n_cols":12,"rows_kept":28,"hidden":true}
[null,"TABLA. PROPIEDADES FÍSICAS DEL AGUA"]
[1,2,3,4,5,6,7,8,{"$nulls":3},1]
["Temperatura","Peso ","Densidad","Viscosidad","Viscosidad","Tensión","Carga a presión","Módulo","Temperatura",null,null,"Temperatura"]
[null,"específico",null,"dinámica","cinemática","superficial","de vapor","Elasticidad Vol."]
["T","g","r","m","n","s","pv *","B","T","Visc cinem T / Visc cinemT = 200C ","g T / g T = 20 0C","T"]
["( 0C )","N/ m3","Kg/ m3","Pa*s x 10 -3","cm2/ s x 10 -2","N / m x 10 -2","m","Pa","( 0C )","(adim.)","(adim.)","( 0C )"]
[0,9806,999.9,1.792,1.792,7.62,0.06,204,0,{"$f":"E7/$E$11","v":{"v":1.7795431976166833,"d":"1.780"}},{"$f":"B7/$B$11","v":{"v":1.001736643170906,"d":"1.002"}},0]
[{"$f":"A7+5","v":5},9807,{"v":1000,"d":"1000.0"},1.519,1.519,7.54,0.09,206,{"$f":"I7+5","v":5},{"v":1.5084409136047667,"d":"1.508"},{"v":1.0018387986515476,"d":"1.002"},{"$f":"L7+5","v":5}]
[10,9804,999.7,1.308,1.308,7.48,0.12,211,10,{"v":1.2989076464746774,"d":"1.299"},{"v":1.001532332209623,"d":"1.002"},10]
[15,9798,999.1,{"v":1.14,"d":"1.140"},1.141,7.41,0.17,214,15,{"v":1.1330685203574977,"d":"1.133"},{"v":1.000919399325774,"d":"1.001"},15]
{"$rows_left_out":19}
{"sheet":"Tramos ACS","index":5,"n_rows":17,"n_cols":80,"rows_kept":17,"merged":[[1,5,1,7],[3,1,3,2],[5,1,5,2],[8,1,8,2],[9,1,9,2],[11,1,11,2],[13,24,13,28],[14,24,14,28],[15,23,15,27]]}
[]
[{"$nulls":5},"INSTALACIÓN DE AGUA CALIENTE",{"$nulls":13},"Medición  de tuberias según diámetro"]
[{"$nulls":19},12,16,20,null,25,32,40,50,63,75,null,90,110,125,140,160]
[null,"Perdida TERMICA tramo + desfavorable",null,{"$f":"SUM(AX:AX)","v":{"v":109.50000000000001,"d":"110 W"}},{"$nulls":15},{"$f":"SUM(BO:BO)","v":0},{"$f":"SUM(BP:BP)","v":0},{"$f":"SUM(BQ:BQ)","v":0},null,{"$f":"SUM(BR:BR)","v":0},{"$f":"SUM(BS:BS)","v":0},{"$f":"SUM(BT:BT)","v":0},{"$f":"SUM(BU:BU)","v":15},{"$f":"SUM(BV:BV)","v":0},{"$f":"SUM(BW:BW)","v":0},null,{"$f":"SUM(BX:BX)","v":0},{"$f":"SUM(BY:BY)","v":0},{"$f":"SUM(BZ:BZ)","v":0},{"$f":"SUM(CA:CA)","v":0},{"$f":"SUM(CB:CB)","v":0}]
[{"$nulls":47},"regimen"]
[null,"Perdida de carga tramo + desfavorable",null,{"$f":"SUM(AW:AW)","v":{"v":2.666430685007481,"d":"2.67 mca"}},{"$nulls":43},"turbulento"]
[{"$nulls":44},"Habitual",null,null,"agua fria"]
[1]
[null,"Tramo",null,"Consumos tipo","Unidades","Consumo","Consumo","Otros Consumos","Caudal","Uso","Qu","fila","suplemento","fila","fila ","fila ","Coef.","Coef.","Coef.","Q l/s","Q l/s","K",null,"Velocidad","Diámetro","Diámetro","Diámetro","Diámetro","Velocidad",null,"Pérdida","Pérdida","+25%","Pérdida","Pérdida",null,"Viscos.","Rugosidad","Número","Factor","Coef.","Coef.","Perdida","Perdida","Perdida","Flamant","Perdida","Perdida","Suma a",null,1,{"$f":"AY9+1","v":2},{"$f":"AZ9+1","v":3},4,5,6,7,8,9,10,11,12,13,14,null,null,{"$f":"AY14","v":0},{"$f":"AZ14","v":0},0,0,0,0,15,0,0,0,0,0,0,0]
[1,"Descripcion",null,null,"de cada","x unidad","instalado",null,"Otros",null,"mayor","tipo","fila","distinto","escuelas","busqueda","A","B","C","TOTAL","simult.","Simult.",null,"Teórica","Teórico Int","Nom. Ext.","Nom. Ext.","Nom. Int.","Real",null,"Tubería","Tubería","Accesorios","Total","TOTAL",null,"agua","Absoluta","Reynols","K/d","rugosidad","rugosidad","Carga","según","según","para ACS","según","según","tramo",null,12,16,20,25,32,40,50,63,75,90,110,125,140,160]
{"$rows_left_out":8}
{"sheet":"Retorno ACS","index":6,"n_rows":34,"n_cols":28,"rows_kept":34,"merged":[[3,2,3,3],[3,5,3,9],[3,11,3,15],[3,18,3,20],[3,21,3,22],[4,5,4,8],[4,11,4,14],[4,18,4,20],[4,21,4,22],[4,23,4,31],[5,5,5,8],[5,11,5,14],[6,5,6,8],[6,11,6,14]]}
[]
[null,null,"RETORNO ACS"]
[]
[null,null,"CRITERIO 1:   Caudal mín. por columna 250 l/h",null,null,"CRITERIO 2:   10% del Qsimultaneo",{"$nulls":5},"CRITERIO 3:   Dif. Temp. Max. 3º ",{"$nulls":6},"Caudal TOTAL",null,null,{"$f":"MAX(D6,J7,P7)*3.6","v":{"v":0.9329505944340185,"d":"0.93 m3/h"}},null,"Bomba de recirculacion ACS",{"$nulls":3},"Wilo Stratos Z"]
[null,null,"Número columnas",1,null,"Caudal suministro simultáneo",{"$nulls":3},{"$f":"'Consumos TIPO'!D14","v":{"v":2.5915294289833843,"d":"2.59 l/s"}},null,"Perdida térmica tramo más desfavorable",{"$nulls":3},{"$f":"'Tramos ACS'!D4","v":{"v":109.50000000000001,"d":"110 W"}},null,null,"Perdida de carga TOTAL",null,null,{"$f":"SUM(D22:P22)+SUM(D32:P32)","v":{"v":2.102890207927999,"d":"2.10 mca"}},null,"http://productfinder.wilo.com/be/en/c000000010002929a00040023/product.html#tab=1"]
[null,null,"Caudal mínimo TOTAL de retorno",{"$f":"D5*D7","v":{"v":0.06944444444444445,"d":"0.07 l/s"}},null,"Caudal mínimo TOTAL de retorno",{"$nulls":3},{"$f":"J5*0.1","v":{"v":0.25915294289833846,"d":"0.26 l/s"}},null,"Caudal mínimo TOTAL de retorno",{"$nulls":3},{"$f":"P5/3.48/3600","v":{"v":0.008740421455938698,"d":"0.01 l/s"}}]
[null,null,"Caudal mínimo por columna CTE HS4",{"$f":"250/3600","v":{"v":0.06944444444444445,"d":"0.07 l/s"}},null,"Caudal mínimo por columna CTE HS4",{"$nulls":3},{"$f":"J6/D5","v":{"v":0.25915294289833846,"d":"0.26 l/s"}},null,"Caudal mínimo por columna CTE HS4",{"$nulls":3},{"$f":"P6/D5","v":{"v":0.008740421455938698,"d":"0.01 l/s"}}]
[]
[null,null,"PEX (Polietileno reticulado)"]
[null,null,"serie 3,2"]
{"$rows_left_out":25}
{"sheet":"Tablas","index":7,"n_rows":237,"n_cols":23,"rows_kept":237,"hidden":true,"merged":[[28,7,28,8],[28,10,28,11],[28,13,28,14],[28,16,28,17],[28,19,28,20],[41,2,41,3],[41,5,41,6],[41,8,41,9],[41,11,41,12],[41,14,41,15],[94,17,94,18],[95,17,95,18],[201,2,201,3]]}
[]
[]
[null,"HS4 tabla 2.1 Caudal Instantáneo mínimo por tipo de aparato",{"$nulls":4},"Tabla activa de diametros"]
[]
[null,"Tipo de aparato","Caudal AF   (dm3/s)","Caudal ACS   (dm3/s)",null,null,"Termo plastico","Cu","Activa"]
[null,"Lavamanos",0.05,0.03,null,"SI",12,6,{"$f":"IF('Consumos TIPO'!$C$46=\"Cobre\",Tablas!H6,Tablas!G6)","v":12}]
[null,"Lavabo",{"v":0.1,"d":"0.10"},{"v":0.065,"d":"0.07"},null,"NO",16,8,{"$f":"IF('Consumos TIPO'!$C$46=\"Cobre\",Tablas!H7,Tablas!G7)","v":16}]
[null,"Ducha",{"v":0.2,"d":"0.20"},{"v":0.1,"d":"0.10"},null,null,20,10,{"$f":"IF('Consumos TIPO'!$C$46=\"Cobre\",Tablas!H8,Tablas!G8)","v":20}]
[null,"Bañera 1,40 o más",{"v":0.3,"d":"0.30"},{"v":0.2,"d":"0.20"},null,null,25,12,{"$f":"IF('Consumos TIPO'!$C$46=\"Cobre\",Tablas!H9,Tablas!G9)","v":25}]
[null,"Bañera menos 1,40",{"v":0.2,"d":"0.20"},0.15,null,null,32,15,{"$f":"IF('Consumos TIPO'!$C$46=\"Cobre\",Tablas!H10,Tablas!G10)","v":32}]
{"$rows_left_out":215}
{"sheet":"RESUMEN","index":8,"n_rows":44,"n_cols":6,"rows_kept":44,"merged":[[1,2,1,5],[3,1,3,5],[33,1,33,5]]}
[]
[null,"Proyecto","25 viviendas Humanes"]
[]
[null,"Consumos tipo Agua Fria"]
[]
[null,{"$f":"'Consumos TIPO'!C46","v":"Termoplastico"},{"$f":"'Consumos TIPO'!D12","v":"serie 5"},"Qs (l/s)","Dnom (mm)","v(m/s)"]
[]
[null,{"$f":"'Consumos TIPO'!H9","v":"VIVIENDA TIPO A"},{"$f":"'Consumos TIPO'!D19","v":"Cocina + 2 baños (ducha + bañera)"},{"$f":"'Consumos TIPO'!E42","v":{"v":0.7143821169100553,"d":"0.71"}},{"$f":"'Consumos TIPO'!E46","v":25},{"$f":"'Consumos TIPO'!E48","v":{"v":2.164372241079824,"d":"2.16"}}]
[null,{"$f":"'Consumos TIPO'!H10","v":"VIVIENDA TIPO B"},{"$f":"'Consumos TIPO'!J19","v":"Duplex Cocina + 3 baños (2xducha + bañera)"},{"$f":"'Consumos TIPO'!K42","v":{"v":0.8009738886567287,"d":"0.80"}},{"$f":"'Consumos TIPO'!K46","v":25},{"$f":"'Consumos TIPO'!K48","v":{"v":2.426720391513742,"d":"2.43"}}]
[null,{"$f":"'Consumos TIPO'!H11","v":"VIVIENDA TIPO C"},{"$f":"'Consumos TIPO'!O19","v":"Cocina + 2 baños (ducha + bañera) + aseo"},{"$f":"'Consumos TIPO'!P42","v":{"v":0.8009738886567287,"d":"0.80"}},{"$f":"'Consumos TIPO'!P46","v":25},{"$f":"'Consumos TIPO'!P48","v":{"v":2.426720391513742,"d":"2.43"}}]
{"$rows_left_out":35}
{"sheet":"Graficos","index":9,"n_rows":43,"n_cols":12,"rows_kept":43,"hidden":true}
{"$rows_empty":42}
[{"$nulls":11},"Diámetro interior suministro:"]